针对你遇到的/usr/bin/ld: cannot find -lsqlite3错误,我们可以按照以下步骤逐一排查和解决问题: 确认系统是否已安装SQLite3库 在Linux系统中,你可以通过包管理器检查SQLite3库是否已经安装。例如,在Debian或Ubuntu系统上,你可以使用以下命令: bash dpkg -l | grep sqlite3 如果系统已安装SQLite3库,你应该能看...
我的makefile找不到我的sqlite3库,我想在gcc命令行中用一个-lsqlite3标志链接它。谁能告诉我,我在这里做错了。错误消息如下:汤姆 浏览0提问于2010-12-14得票数 0 1回答 Makefile错误: /usr/bin/ld:找不到-lsqlite3 、、 .cINC := -I include -I path/to/pathname/sqlite3/include @mk...
linux编译:提示/usr/bin/ld: can not find -lsqlite3 的解决办法,程序员大本营,技术文章内容聚合第一站。
linux编译:提示/usr/bin/ld: can not find -lsqlite3 的解决办法 编译程序提示缺少sqlite3的情况下,如果在其他arm编译器下有现成的库,可以直接拷贝过来。 sudo cp /opt/arm-2008q3/arm-none-linux-gnueabi/libc/armv4t/lib/libsqlite3.so /opt/arm-2013.11/arm-none-linux-gnueabi/libc/armv4t/lib/ 如下...
(Linux ) gcc 编译失败:/usr/bin/ld: cannot find -lxxx-浮生-搜狐博客 gcc xx.c -o abc -lxxx 的时候出现如下错误: /usr/bin/ld: cannot find -lxxx collect2: ld returned 1 exit status 原因:gcc找不到需要链接的lib 解决方案:
lcurl -lm -lpthread -o ntopng /usr/bin/ld: cannot find -l/usr/lib/libz.a collect2: error: ld returned 1 exit status make[1]: *** [Makefile:162: ntopng] Error 1 make[1]: Leaving directory '/usr/src/ntopng' make: *** [ntopng:91: /usr/src/log/ntopng-3.3.270318] Error 2 ...
安装codebot控件时lazarus 编译时提示: Warning: linker: /usr/bin/ld.bfd: cannot find -lcurl: No such file or directory 解决办法: sudo apt install libcurl4-openssl-dev
/usr/bin/ld: cannot find /usr/lib64/libatomic.so.1.2.0 collect2: error: ld returned 1 exit status make: *** [Makefile:83: duperemove] Error 1 [chris@f26s duperemove]$ sudo find /usr/ -name libatomic* /usr/lib/gcc/x86_64-redhat-linux/7/32/libatomic.a /usr/lib/gcc/x86_64-...
1回答 hello world在gcc 5.3.0 /bin/ld上失败:无效选项-- 'p‘ c++、c、gcc COLLECT_GCC=g++COLLECT_LTO_WRAPPER=/home/mybin/libexec/gcc/x86_64-unknown-linux-gnu/5.3.0/ 浏览1提问于2016-01-16得票数 0 1回答 查看了相关帖子,还是不能在没有root权限的Linux上安装GCC 4.7? linux、gcc、installati...
/lib64/ld-linux-x86-64.so.2 (0x00007ff4e17f1000) libtbb.so.2 => /usr/local/MATLAB/R2018a/bin/glnxa64/./libtbb.so.2 (0x00007ff4d6368000) libtbbmalloc.so.2 => /usr/local/MATLAB/R2018a/bin/glnxa64/./libtbbmalloc.so.2 (0x00007ff4d6112000) ...