客户报告,用RMAN 的 duplicate 命令,在具备RAC环境的standby 端,创建standby 数据库时,失败。 报:ORA-19504、ORA-17502、ORA-15001、ORA-27140 执行的过程如下: [oracle @ racddb001g ~] $ export OR
ORA-19870是Oracle数据库中的一个错误代码,具体表示“无法加载或执行指定的库(library)或函数(function)”。这个错误通常与Oracle数据库尝试调用外部库或函数时遇到的问题相关,可能是由于库文件不存在、路径错误、权限问题或库文件本身损坏等原因造成的。 ORA-19870错误的可能原因 库文件不存在:Oracle数据库尝试加载的库...
channel ORA_DISK_1: reading from backup piece /<backup piece path>/<backup piece name> channel ORA_DISK_1: ORA-19870: error while restoring backup piece /<backup piece path>/<backup piece name> ORA-19504: failed to create file "+DATA/<db file name>" ORA-17502: ksfdcre:3 Failed to ...
ASM实例报错有的ORA-600 [kssrmp1]以及ORA-04031错误,还有如下: ORA-19870: error reading backup piece/full.bak ORA-19504: failed to create file "+DATA1" ORA-17502: ksfdcre:4 Failed to create file +DATA1 ORA-15055: unable to connect to ASM instance 介入时候,因为客户是通过加密机+TEAMVIEWER+...
Oracle Database Configuration Assistant - Version 10.2.0.1 to 10.2.0.4 [Release 10.2]: ORA-19624 ORA-19870 ORA-19504 ORA-27086 When Creating A Database Using DBCA On
ORA-19504: failed to create file "string" Cause: call to create file returned an error Action: check additional messages, check access permissions. ORA-19505: failed to identify file "string" Cause: call to identify the file returned an error Action: check additional messages, and chec...
ORA-19870: バックアップ・ピースstringのリストア中にエラーが発生しました 原因: このエラーに付随して、問題の原因を示すその他のエラー・メッセージが表示されます。 処置: 他のエラー処置を参照してください。 ORA-19873: このバックアップ・セクションはファイルstringに適用...
ORA-19870: バックアップ・ピースstringのリストア中にエラーが発生しました 原因: このエラーに付随して、問題の原因を示すその他のエラー・メッセージが表示されます。 処置: 他のエラー処置を参照してください。 ORA-19873: このバックアップ・セクションはファイルstringに適用...
ORA-19870、ORA-19573错误处理 现象: RMAN-00571: === RMAN-00569: === ERROR MESSAGE STACK FOLLOWS === RMAN-00571: === RMAN-03002: failure of recover command at 01/12/2013 21:16:08 ORA-19870: error reading backup piece /u01/rmanbak/for18dg/standby_PORT_20130112_1fnv8622_1_1.bak OR...
[oracle 工程师手记]RMAN duplicate 发生ORA-19504、ORA-17502、ORA-15001、ORA-27140 错误的解决过程,客户报告,用RMAN的duplicate命令,在具备RAC环境的standby端,创建standby数据库时,失败。报:ORA-19504、ORA-17502、ORA-15001、ORA-27140执行的过程如下:[oracle@r