针对你遇到的问题 scripts/dtc/dtc-parser.tab.o:(.bss+0x10): multiple definition of 'yylloc',我们可以按照以下步骤进行分析和解决: 1. 理解错误信息 "multiple definition of `yylloc'" 这条错误信息表明,在编译过程中,编译器在多个地方找到了 yylloc 的定义。在C或C++项目中,全局变量或符号(如 yylloc)通...
/usr/bin/ld:scripts/dtc/dtc-parser.tab.o:(.bss+0x50):multiple definition of `yylloc'; scripts/dtc/dtc-lexer.lex.o:(.bss+0x0): first defined here collect2: error: ld returned 1 exit status make[2]: *** [scripts/Makefile.host:127: scripts/dtc/dtc] Error 1 make[1]: *** [sc...
解决Clion中多个cpp文件运行时出现multiple definition of `main' 在最初使用Clion这款软件做C++开发时,有时会遇到在同一个Project中有多个cpp文件,而每个cpp文件又都有main函数,因此运行时会出现multiple definition of `main'这样的错误。 一,问题重现 二,解决问题 这是因为一个编译链接生成的EXE文件只能有一个mai...
(.bss+0x10): multiple definition of `yylloc'; scripts/dtc/dtc-lexer.lex.o:(.bss+0x0): first defined here collect2: error: ld returned 1 exit status make[4]: *** [scripts/Makefile.host:111: scripts/dtc/dtc] Error 1 make[3]: *** [scripts/Makefile.build:587: scripts/dtc] ...
1、编译内核 /usr/bin/ld: scripts/dtc/dtc-parser.tab.o:(.bss+0x50): multiple definition of `yylloc'; scripts/dtc/dtc-lexer.lex.o:(.bss+0x0): first defined here collect2: error: ld returned 1 exit status make[2]: *** [scripts/Makefile.host:100:scripts/dtc/dtc] 错误 1 ...
kernel内核编译遇到/usr/bin/ld:scripts/dtc/dtc-parser.tab.o:(.bss+0x50)multiple definitionof“yylloc“ 一、问题解决过程 在搭建zynq_zturn的ubuntu开发环境的过程中我遇到了如下问题: 百度以后发现有人出现过类似的问题,这是找到的第一篇博客:传送门 这篇博客的解决方法是通过vim打开第二次出现变量定义的...
原因:ubuntu22.04默认gcc版本过高,超过gcc v10.0即会报错. 解决方案即是降低gcc版本。 sudo apt install gcc-9g++-9sudo update-alternatives--install/usr/bin/gcc gcc/usr/bin/gcc-9100sudo update-alternatives--install/usr/bin/g++g++/usr/bin/g++-9100gcc-v...
error:multiple definition of `yylloc' 经尝试与交叉编译器无关,gcc-arm-9.2-2019.12-x86_64-arm-none-linux-gnueabihf和10.3版本都出同样的错误。 经网上查询,好像是gcc编译器10及以上版本才会出现问题,解决方法没有更换gcc编译器,方法如下: 解决方法: 1177行,将yylloc注释掉。yylloc已经在其他文件定义,并且dtc-...
/usr/bin/ld: scripts/dtc/dtc-parser.tab.o:(.bss+0x50): multiple definition of `yylloc'; scripts/dtc/dtc-lexer.lex.o:(.bss+0x0): first defined here collect2: 错误:ld 返回 1 make[2]: *** [scripts/Makefile.host:100:scripts/dtc/dtc] 错误 1 ...
解决办法:https://blog.csdn.net/zhoukaiqili/article/details/126191871 分类:linux基础知识 好文要顶关注我收藏该文微信分享 lh03061238 粉丝-36关注 -7 +加关注 0 0 升级成为会员 «ptrace使用与测试 »Linux内核—percpu 刷新页面返回顶部 登录后才能查看或发表评论,立即或者逛逛博客园首页 ...