2. 编译参数错误:make命令执行时,可能由于编译参数设置错误而导致error 2的错误。例如,指定了错误的编译选项或未正确设置程序的源文件路径等。解决方法是检查makefile文件中的编译参数设置,并确保其正确无误。 3. 源代码错误:有时程序源代码本身存在错误,例如语法错误或逻辑错误,这也可能导致error 2的错误。解决方法...
*** No rule to make target 'subscribe_pkg/CMakeFiles/subscribe_pkg_node.dir/build'。 停止。 CMakeFiles/Makefile2:957: recipe for target 'subscribe_pkg/CMakeFiles/subscribe_pkg_node.dir/all' failed 修改已知错误后,报出如上错误,则删掉编译结果,再次编译。 二 CMake Error: Error in cmake c...
Linux 执行Make 出错 执行make 编译Uboot时候报错: YACC scripts/kconfig/zconf.tab.c /bin/sh: 1: bison: not found scripts/Makefile.lib:226: recipe for target 'scripts/kconfig/zconf.tab.c' failed make[2]: *** [scripts/kconfig/zconf.tab.c] Error 127 Makefile:516: recipe for target 's5p...
scripts/Makefile.build:587: recipe for target 'drivers/md' failed make[2]: *** [drivers/md]...
Makefile是用于告诉make命令如何编译和构建程序的脚本文件。解决方法是确保当前目录中存在Makefile文件,并且文件名拼写正确。如果不存在Makefile文件,可以创建一个新的Makefile文件,并在其中定义编译和构建规则。 3. “make: *** [target] Error 1”错误这个错误表示make命令在执行时遇到了错误,导致构建过程失败。解决...
在Linux环境中,`make`命令用于自动化编译过程,根据Makefile中的规则来构建项目。当`make`出错时,通常是由于以下几种原因: ### 基础概念 - **Makefile**: 一个...
make[1]: *** [CMakeFiles/Makefile2:1689: modules/core/CMakeFiles/opencv_test_core.dir/all] Error 2make: *** [Makefile:166: all] Error 2 2024-11-27 回复喜欢 LGD.Wizard 你好,现在4.10.0版本的BUILD_opencv_python3好像已经找不到了。是不是要替换成Opencv_python3_version呀 2024...
编译内核模块时忽略“-isystem”标志的Makefile 、、 目前,我的所有代码都运行良好,但是在编译时,我也收到了来自内核头文件的警告,这使我发现很难看到我自己可能意外忽略的任何错误。我找到了一个关于如何禁用来自外部库的警告的答案,这说明我需要使用GCC -isystem {dir}标志,但是这似乎不起作用。有人能指出我做错...
报错4:make: *** [xxx] Error x 这个错误通常表示在编译或链接过程中发生了错误,可能是由于代码错误或Makefile配置问题。可以通过以下步骤解决: 检查报错信息中提到的文件和行号,定位可能存在的代码错误。 检查Makefile配置是否正确,可以尝试重新生成Makefile或修改其中的相关配置。