错误#10234-D:未解析的符号仍然存在 错误#10010:链接期间遇到错误;未生成"tFG_0.002.out"
用CCS按照例程建立工程编译报错 我想用CCS按照官方给的例程建立一个工程,代码都是从例程复制的,头文件路径和添加的C文件都和例程一样,但是编译老是报错(error #10234-D: unresolved symbols remain),细看错误是找不到串口相关的函数定义,我就搞不懂我的工程和官方的看界面都差不多呀,怎么官方的就能找到函数...
error #10234-D: unresolved symbols remain error #10010: errors encountered during linking; "dsp-Time0.out" not built >> Compilation failure makefile:177: recipe for target 'dsp-Time0.out' failed gmake: *** [dsp-Time0.out] Error 1 gmake: Target 'all' not remade because of errors. 学...
错误1、error #7 :unrecognized token... 解决办法:打开CCS6软件,window—>preferences—>workspace—>“Text file encoding”将默认的CP1252编码改成other中的UTF-8或UC-ASCII,这种修改也可以解决拷贝进来的文件中注释乱码的现象。 错误2、error #10234-D:unresolved symbols remain 解决办法:Properties->predefined ...
"D:\ti\ccsv5\utils\bin\gmake" -k all 'Building file: E:/learn_codes/ti/DEC6713_SDRAM/DEC...
#10234-D: unresolved symbols remainerror #10010: errors encounteredduringlinking; "EMD.out jsdfjsdfew2018-07-25 09:27:08 实现一个算法时出现了如下问题, encounteredduringlinking; "EMD.out" notbuilt>> Compilation failure gmake: *** [EMD.out ...
3.error: #10234-D: unrecognized pragma 这种报错通常是由于编译器不支持或不识别的编译指令引起的。解决方法是查阅编译器手册,确认该编译指令的使用方法是否正确。 4.error: #10099-D: program will not fit into available memory … 这种报错通常是由于代码大小超出了目标芯片的可用空间引起的。解决方法是优化代...
error #10234-D: unresolved symbols remain error #10010: errors encountered during linking; "PruebaBlinking.out" not built >> Compilation failure makefile:141: recipe for target 'PruebaBlinking.out' failed gmake[1]: *** [PruebaBlinking.out] Error 1 ...
error #10234-D: unresolved symbols remain error #10010: errors encountered during linking; "PruebaBlinking.out" not built >> Compilation failure makefile:141: recipe for target 'PruebaBlinking.out' failed gmake[1]: *** [PruebaBlinking.out] Error 1 ...
error #10234-D: unresolved symbols remain error #10010: errors encountered during linking; "SP_EV_OpenLoopTest.out" not built 原因是COFF格式时,CMD文件中对应的几个变量前面要加下划线_,改为图3所示后即可编译通过。 图3 编译选项--idiv_support选择为none时的说明: ...