[build] [ 60%] Built target mylib [build] Consolidate compiler generated dependencies of target test [build] gmake[2]: *** No rule exists to target „lib/extern/lib/liba12.so“, [build] required by „test“ to create. Ending. [build] gmake[1]: *** [CMakeFiles/Makefile2:111:...
make依据它来批处理编译,这个文件就是makefile,所以编写makefile文件也是一个程序员所必备的技能。
make[2]: *** No rule to make target '/usr/local/lib/libjsoncpp.a', needed by '../core/rocketmq-client-cpp/bin/librocketmq.so'. Stop. CMakeFiles/Makefile2:2664: recipe for target 'core/rocketmq-client-cpp/project/CMakeFiles/rocketmq_shared.dir/all' failed make[1]: *** [core...
如果没有add_custom_target那一行,执行编译构建会报错,由此也可见一斑: make[2]: *** No rule to make target `libmerge.a', needed by `demo' 以上便是CMake下合并静态库的实践,欢迎交流指正。 原文首发于公众号:很酷的程序员,欢迎关注留言,共同进步 ...
CMake runs okay, but: $ make install make: *** No rule to make target `install'. Stop. I also had this problem with the other DataFrame C++ library on github. Somethings wrong with make on Windows 10. So the build process instructions ar...
make[2]: *** No rule to make target'/usr/lib/x86_64-linux-gnu/libproj.so', needed by'pcd_write'. Stop. CMakeFiles/Makefile2:67: recipefortarget'CMakeFiles/pcd_write.dir/all'failed make[1]: *** [CMakeFiles/pcd_write.dir/all] Error2Makefile:83: recipefortarget'all'failed ...
make[2]: *** No rule to make target '/home/filex/anaconda3/lib/libpng.so', needed by 'lib/libpcl_io.so.1.9.0'. Stop. CMakeFiles/Makefile2:250: recipe for target 'io/CMakeFiles/pcl_io.dir/all' failed 这意思是又需要anaconda3/lib了?抱着试一试的想法又把anaconda3/lib还原了回来,...
2,错误make[2]: *** No rule to make target `lib/libPocoFoundation.so.1 (2014-12-22).6 (2014-12-22).0 (2014-12-22)', needed by `lib/libPocoXML.so.30'. Stop. make[1]: *** [XML/CMakeFiles/XML.dir/all] Error 2
Log data follows: | DEBUG: Executing shell function do_install | NOTE: make -j 4 DESTDIR=/home/student/fsl-release-bsp/build-analytics-tflite/tmp/work/cortexa9hf-neon-poky-linux-gnueabi/minimal/1.0-r0/image install | ERROR: oe_runmake failed | make: *** No rule to make target 'insta...
make[2]: *** No rule to make target `hello_module.mod.proxy', needed by `CMakeFiles/hello_program.dir/hello_program.o.requires'. Stop. make[2]: Leaving directory `/home/software/plplot_cvs/HEAD/testbuild_dir' make[1]: *** [CMakeFiles/hello_program.dir/all] Error 2 ...