make依据它来批处理编译,这个文件就是makefile,所以编写makefile文件也是一个程序员所必备的技能。
[build] gmake[2]: *** No rule exists to target „lib/extern/lib/liba12.so“, [build] required by „test“ to create. Ending. [build] gmake[1]: *** [CMakeFiles/Makefile2:111: CMakeFiles/test.dir/all] Error 2 [build] gmake: *** [Makefile:91: all] Error 2 [proc] The...
ROS问题:No rule to make target 'learning_tf/CMakeFiles/turtle_tf_broadcaster.dir/build'. Stop.,程序员大本营,技术文章内容聚合第一站。
CMake runs okay, but: $ make install make: *** No rule to make target `install'. Stop. I also had this problem with the other DataFrame C++ library on github. Somethings wrong with make on Windows 10. So the build process instructions ar...
Log data follows: | DEBUG: Executing shell function do_install | NOTE: make -j 4 DESTDIR=/home/student/fsl-release-bsp/build-analytics-tflite/tmp/work/cortexa9hf-neon-poky-linux-gnueabi/minimal/1.0-r0/image install | ERROR: oe_runmake failed | make: *** No rule to make target 'insta...
make[2]: *** No rule to make target `hello_module.mod.proxy', needed by `CMakeFiles/hello_program.dir/hello_program.o.requires'. Stop. make[2]: Leaving directory `/home/software/plplot_cvs/HEAD/testbuild_dir' make[1]: *** [CMakeFiles/hello_program.dir/all] Error 2 ...
No rule to make target `-', needed by `all'. Stop. 在编译touchlink的时候,只因为备份了一个touchlink.c为touchlink - 副本.c,导致出现编译提示 make[4]: *** No rule to make target `-', needed by `all'. Stop. 的错误。 解决办法:删除touchlink - 副本.c这个文件名中的空格(这个空格会...
如果没有add_custom_target那一行,执行编译构建会报错,由此也可见一斑: make[2]: *** No rule to make target `libmerge.a', needed by `demo' 以上便是CMake下合并静态库的实践,欢迎交流指正。 原文首发于公众号:很酷的程序员,欢迎关注留言,共同进步 ...
make[2]: *** No rule to make target '/home/filex/anaconda3/lib/libpng.so', needed by 'lib/libpcl_io.so.1.9.0'. Stop. CMakeFiles/Makefile2:250: recipe for target 'io/CMakeFiles/pcl_io.dir/all' failed 这意思是又需要anaconda3/lib了?抱着试一试的想法又把anaconda3/lib还原了回来,...
点击Tools–>Options–>Kits–>Compilers,复制箭头指向的文件路径,填写如上图配置窗口 点击Configure,按照教程重新编译即可 出现的问题(二): 编译OpenCV时出现错误提示: mingw32-make[1]: CMakeFiles\Makefile2: No such file or directory mingw32-make[1]: *** No rule to make target 'CMakeFiles\Makefile...